BDBM50224639 CHEMBL59643
SMILES COc1ccccc1N1CCN(CCN2C(=O)CC3(CCCCCCC3)C2=O)CC1
InChI Key InChIKey=SVUBMTPNCZKBBG-UHFFFAOYSA-N
Data  2 IC50
  Tab Delimited (TSV)   2D SDfile   Computed 3D by Vconf -m prep SDfile
Find this compound or compounds like it in BindingDB:
Activity Spreadsheet -- Enzyme Inhibition Constant Data from BindingDB
Found 1 hit for monomerid = 50224639
TargetAlpha-1A/Alpha-1B/Alpha-1D adrenergic receptor(Rattus norvegicus (rat))
TBA
Curated by ChEMBL
LigandPNGBDBM50224639(CHEMBL59643)
Affinity DataIC50: >1.00E+3nM. Assay description: Inhibition of [3H]WB-4101 binding to alpha-1-adrenergic receptor from rat cerebral cortex membranes
In DepthDetails ArticlePubMed